{"text_format":"1","workbook":"xlsx","n_sheets":5,"sheets":["作成入力について","所属競技者データ","申込個票","申込み一覧男子","申込み一覧女子"],"not_rendered":{"charts":0,"images":2,"macros":1,"external_links":0,"defined_names":4,"comments":0,"pivot_tables":0},"unopened":[],"bounds":{"document_bytes":16777216,"sheet_cells":100000,"rows_first":2000,"rows_last":500,"rows_between":2000,"halvings":0,"cell_chars":16384,"cell_head_chars":4096},"cells_cut":0,"cells_raw":0,"read":"whole","date_system":"1900"}

{"sheet":"作成入力について","index":0,"n_rows":140,"n_cols":50,"rows_kept":140,"cut":false,"hidden":false,"merged":[[5,6,5,14],[61,11,61,14],[121,11,121,14],[17,11,17,13],[18,7,18,10],[9,6,9,14],[20,7,20,10],[17,7,17,10],[18,11,18,13],[19,11,19,13],[20,11,20,13],[19,7,19,10],[58,13,58,14]]}
[]
[]
[]
[]
[]
[null,null,null,null,null,null,"提　出　申　込　ファイル　作　成　に　つ　い　て　"]
[]
[null,null,null,null,null,null,"* このファイルの扱いについて。"]
[null,null,null,null,null,null,"個人情報が含まれています。取扱については、細心の注意をお願いします。"]
[null,null,null,null,null,null,"要注意です。 セル・行・列の削除・挿入は、\n数式が崩れ,未・誤表示の原因になります。"]
{"$rows_left_out":131}
{"sheet":"所属競技者データ","index":1,"n_rows":132,"n_cols":53,"rows_kept":132,"cut":false,"hidden":false,"merged":[[5,8,5,11],[7,17,7,19]]}
[]
[]
[]
[]
[]
[null,null,null,null,null,null,null,"団体略称(６文字以内)",null,null,null,null,"⇇","この表示は申込一覧表の、団体略称に表示されます。"]
[null,null,null,null,null,null,"男子・女子データ欄を入力完了後、データ整列をクリックして下さい。"]
[null,null,null,null,null,"男子データ（１００名分）",null,null,null,null,null,null,null,"女子データ（１００名分）",null,null,null,"データ作成説明へ"]
[null,null,null,null,null,"入力例",1234,"千葉","一郎",2,"千葉","98.05.26",null,"入力例",1234,"東葛","花子",2,"東京","03.05．26"]
[null,null,null,null,null,"団体内\n整理\n番号","登　録\nナンバー","氏","名","学年","県　名","生年月日",null,"団体内\n整理\n番号","登　録\nナンバー","氏","名","学年","県　名","生年月日"]
{"$rows_left_out":123}
{"sheet":"申込個票","index":2,"n_rows":156,"n_cols":71,"rows_kept":156,"cut":false,"hidden":false,"merged":[[1,54,1,70],[2,9,2,16],[2,25,2,32],[2,36,2,37],[1,36,1,37],[1,27,1,28],[1,4,1,25],[3,2,3,5],[3,18,3,21],[3,36,3,41],[2,2,2,8],[2,18,2,24]]}
[]
[null,null,null,null,"このシートは個票の男女各１２０種目人分です。入力したデータは、申込み一覧表に表示反映されます。\n正しく表示されない場合は、所属競技者データ作成での半角英数入力・ソート（並び替え）をして下さい。",null,null,null,null,null,null,null,null,null,null,null,null,null,null,null,null,null,null,null,null,null,null,null,null,null,null,null,null,null,null,null,"競技者\nデータページ",null,null,null,null,null,null,null,null,null,null,null,null,null,null,null,null,null,"入力データ、\n半角英数処理表示列"]
[null,null,"男子競技者データ\n（申込み個票）",null,null,null,null,null,null,"入力は、下部黄色セルだけです。種目・集計数は右記を参照。なお　リレーは　４００RSA、４００RSB、　16００RＳA、16００RＳB　のように入力",null,null,null,null,null,null,null,null,"女子競技者データ\n（申込み個票）",null,null,null,null,null,null,"入力は、下部黄色セルだけです。種目・集計数は右記を参照。なお　リレーは　４００RSA、４００RSB、　16００RＳA、16００RＳB　のように入力",null,null,null,null,null,null,null,null,null,null,"競技者データ\n作成の説明へ",null,null,null,null,null,null,null,null,null,null,null,null,null,null,null,null,null,"男子",null,null,null,null,null,null,null,null,"女子"]
[null,null,"男子所属競技者\n整理番号一覧表",null,null,null,null,"整理\n番号\n入力①","登　録\nナンバー","出場競技\n種目名\n入力②","自己ベスト\n申請記録\n入力③","氏","名","所属","学年","出身\n都道府県","生年月日\n西暦下２桁",null,"女子所属競技者\n整理番号一覧表",null,null,null,null,"整理\n番号\n入力①","登　録\nナンバー","出場競技\n種目名\n入力②","自己ベスト\n申請記録\n入力③","氏","名","所属","学年","出身\n都道府県","生年月日\n西暦下２桁",null,null,null,"参加種目入力数集計確認表",null,null,null,null,null,null,null,null,null,null,null,null,null,null,null,null,null,"ナンバー","出場競技","申請記録","氏","名","支部","所属","学年",null,"ナンバー","出場競技","申請記録","氏","名","支部","所属","学年"]
[null,null,"番号","競技者名",null,null,null,1,1234,3000,10.119999999999999,"松戸","一郎","東葛大",2,"東京","98.05．26",null,"番号","競技者名",null,null,null,1,5688,1500,5.15,"千葉","花子","club チーバ",null,null,"98.05．26",null,null,null,"開催種目名","入力記号","男子人数",null,"女子人数"]
[null,null,1,{"$f":"IF(所属競技者データ!H11=\"\",\"\",所属競技者データ!H11&\" \"&所属競技者データ!I11)","v":""},null,null,null,null,{"$f":"IF($H6=\"\",\"\",(VLOOKUP($H6,所属競技者データ!$F$11:$L$110,2,FALSE)))","v":""},null,null,{"$f":"IF($H6=\"\",\"\",(VLOOKUP($H6,所属競技者データ!$F$11:$L$110,3,FALSE)))","v":""},{"$f":"IF($H6=\"\",\"\",(VLOOKUP($H6,所属競技者データ!$F$11:$L$110,4,FALSE)))","v":""},{"$f":"IF(H6=\"\",\"\",所属競技者データ!$I$6)","v":""},{"$f":"IF($H6=\"\",\"\",(VLOOKUP($H6,所属競技者データ!$F$11:$L$110,5,FALSE)))","v":""},{"$f":"IF($H6=\"\",\"\",(VLOOKUP($H6,所属競技者データ!$F$11:$L$110,6)))","v":""},{"$f":"IF($H6=\"\",\"\",(VLOOKUP($H6,所属競技者データ!$F$11:$L$110,7,FALSE)))","v":""},null,1,{"$f":"IF(所属競技者データ!P11=\"\",\"\",所属競技者データ!P11&\" \"&所属競技者データ!Q11)","v":""},null,null,null,null,{"$f":"IF($X6=\"\",\"\",(VLOOKUP($X6,所属競技者データ!$N$11:$T$110,2,FALSE)))","v":""},null,null,{"$f":"IF($X6=\"\",\"\",(VLOOKUP($X6,所属競技者データ!$N$11:$T$110,3,FALSE)))","v":""},{"$f":"IF($X6=\"\",\"\",(VLOOKUP($X6,所属競技者データ!$N$11:$T$110,4,FALSE)))","v":""},{"$f":"IF(X6=\"\",\"\",所属競技者データ!$I$6)","v":""},{"$f":"IF($X6=\"\",\"\",(VLOOKUP($X6,所属競技者データ!$N$11:$T$110,5,FALSE)))","v":""},{"$f":"IF($X6=\"\",\"\",(VLOOKUP($X6,所属競技者データ!$N$11:$T$110,6)))","v":""},{"$f":"IF($X6=\"\",\"\",(VLOOKUP($X6,所属競技者データ!$N$11:$T$110,7,FALSE)))","v":""},null,null,null,"　１００ｍ  計",100,{"$f":"COUNTIFS(J$6:J$125,$AL6)","v":0},"人",{"$f":"COUNTIFS(Z$6:Z$125,$AL6)","v":0},"人",null,null,null,null,null,null,null,null,null,null,null,null,{"$f":"IF($H6=\"\",\"\",(ASC(I6)))","v":""},{"$f":"IF($H6=\"\",\"\",(ASC(J6)))","v":""},{"$f":"IF($H6=\"\",\"\",(ASC(K6)))","v":""},{"$f":"IF($H6=\"\",\"\",(ASC(L6)))","v":""},{"$f":"IF($H6=\"\",\"\",(ASC(M6)))","v":""},null,{"$f":"IF($H6=\"\",\"\",(ASC(N6)))","v":""},{"$f":"IF($H6=\"\",\"\",(ASC(O6)))","v":""},null,{"$f":"IF($X6=\"\",\"\",(ASC(Y6)))","v":""},{"$f":"IF($X6=\"\",\"\",(ASC(Z6)))","v":""},{"$f":"IF($X6=\"\",\"\",(ASC(AA6)))","v":""},{"$f":"IF($X6=\"\",\"\",(ASC(AB6)))","v":""},{"$f":"IF($X6=\"\",\"\",(ASC(AC6)))","v":""},null,{"$f":"IF($X6=\"\",\"\",(ASC(AD6)))","v":""},{"$f":"IF($X6=\"\",\"\",(ASC(AE6)))","v":""}]
[null,null,2,{"$f":"IF(所属競技者データ!H12=\"\",\"\",所属競技者データ!H12&\" \"&所属競技者データ!I12)","v":""},null,null,null,null,{"$f":"IF($H7=\"\",\"\",(VLOOKUP($H7,所属競技者データ!$F$11:$L$110,2,FALSE)))","v":""},null,null,{"$f":"IF($H7=\"\",\"\",(VLOOKUP($H7,所属競技者データ!$F$11:$L$110,3,FALSE)))","v":""},{"$f":"IF($H7=\"\",\"\",(VLOOKUP($H7,所属競技者データ!$F$11:$L$110,4,FALSE)))","v":""},{"$f":"IF(H7=\"\",\"\",所属競技者データ!$I$6)","v":""},{"$f":"IF($H7=\"\",\"\",(VLOOKUP($H7,所属競技者データ!$F$11:$L$110,5,FALSE)))","v":""},{"$f":"IF($H7=\"\",\"\",(VLOOKUP($H7,所属競技者データ!$F$11:$L$110,6)))","v":""},{"$f":"IF($H7=\"\",\"\",(VLOOKUP($H7,所属競技者データ!$F$11:$L$110,7,FALSE)))","v":""},null,2,{"$f":"IF(所属競技者データ!P12=\"\",\"\",所属競技者データ!P12&\" \"&所属競技者データ!Q12)","v":""},null,null,null,null,{"$f":"IF($X7=\"\",\"\",(VLOOKUP($X7,所属競技者データ!$N$11:$T$110,2,FALSE)))","v":""},null,null,{"$f":"IF($X7=\"\",\"\",(VLOOKUP($X7,所属競技者データ!$N$11:$T$110,3,FALSE)))","v":""},{"$f":"IF($X7=\"\",\"\",(VLOOKUP($X7,所属競技者データ!$N$11:$T$110,4,FALSE)))","v":""},{"$f":"IF(X7=\"\",\"\",所属競技者データ!$I$6)","v":""},{"$f":"IF($X7=\"\",\"\",(VLOOKUP($X7,所属競技者データ!$N$11:$T$110,5,FALSE)))","v":""},{"$f":"IF($X7=\"\",\"\",(VLOOKUP($X7,所属競技者データ!$N$11:$T$110,6)))","v":""},{"$f":"IF($X7=\"\",\"\",(VLOOKUP($X7,所属競技者データ!$N$11:$T$110,7,FALSE)))","v":""},null,null,null,"　　〃　         １年",100,{"$f":"COUNTIFS($J$6:$J$125,$AL7,$O$6:$O$125,1)","v":0},null,{"$f":"COUNTIFS($Z$6:$Z$125,$AL7,$AE$6:$AE$125,1)","v":0},null,null,null,null,null,null,null,null,null,null,null,null,null,{"$f":"IF($H7=\"\",\"\",(ASC(I7)))","v":""},{"$f":"IF($H7=\"\",\"\",(ASC(J7)))","v":""},{"$f":"IF($H7=\"\",\"\",(ASC(K7)))","v":""},{"$f":"IF($H7=\"\",\"\",(ASC(L7)))","v":""},{"$f":"IF($H7=\"\",\"\",(ASC(M7)))","v":""},null,{"$f":"IF($H7=\"\",\"\",(ASC(N7)))","v":""},{"$f":"IF($H7=\"\",\"\",(ASC(O7)))","v":""},null,{"$f":"IF($X7=\"\",\"\",(ASC(Y7)))","v":""},{"$f":"IF($X7=\"\",\"\",(ASC(Z7)))","v":""},{"$f":"IF($X7=\"\",\"\",(ASC(AA7)))","v":""},{"$f":"IF($X7=\"\",\"\",(ASC(AB7)))","v":""},{"$f":"IF($X7=\"\",\"\",(ASC(AC7)))","v":""},null,{"$f":"IF($X7=\"\",\"\",(ASC(AD7)))","v":""},{"$f":"IF($X7=\"\",\"\",(ASC(AE7)))","v":""}]
[null,null,3,{"$f":"IF(所属競技者データ!H13=\"\",\"\",所属競技者データ!H13&\" \"&所属競技者データ!I13)","v":""},null,null,null,null,{"$f":"IF($H8=\"\",\"\",(VLOOKUP($H8,所属競技者データ!$F$11:$L$110,2,FALSE)))","v":""},null,null,{"$f":"IF($H8=\"\",\"\",(VLOOKUP($H8,所属競技者データ!$F$11:$L$110,3,FALSE)))","v":""},{"$f":"IF($H8=\"\",\"\",(VLOOKUP($H8,所属競技者データ!$F$11:$L$110,4,FALSE)))","v":""},{"$f":"IF(H8=\"\",\"\",所属競技者データ!$I$6)","v":""},{"$f":"IF($H8=\"\",\"\",(VLOOKUP($H8,所属競技者データ!$F$11:$L$110,5,FALSE)))","v":""},{"$f":"IF($H8=\"\",\"\",(VLOOKUP($H8,所属競技者データ!$F$11:$L$110,6)))","v":""},{"$f":"IF($H8=\"\",\"\",(VLOOKUP($H8,所属競技者データ!$F$11:$L$110,7,FALSE)))","v":""},null,3,{"$f":"IF(所属競技者データ!P13=\"\",\"\",所属競技者データ!P13&\" \"&所属競技者データ!Q13)","v":""},null,null,null,null,{"$f":"IF($X8=\"\",\"\",(VLOOKUP($X8,所属競技者データ!$N$11:$T$110,2,FALSE)))","v":""},null,null,{"$f":"IF($X8=\"\",\"\",(VLOOKUP($X8,所属競技者データ!$N$11:$T$110,3,FALSE)))","v":""},{"$f":"IF($X8=\"\",\"\",(VLOOKUP($X8,所属競技者データ!$N$11:$T$110,4,FALSE)))","v":""},{"$f":"IF(X8=\"\",\"\",所属競技者データ!$I$6)","v":""},{"$f":"IF($X8=\"\",\"\",(VLOOKUP($X8,所属競技者データ!$N$11:$T$110,5,FALSE)))","v":""},{"$f":"IF($X8=\"\",\"\",(VLOOKUP($X8,所属競技者データ!$N$11:$T$110,6)))","v":""},{"$f":"IF($X8=\"\",\"\",(VLOOKUP($X8,所属競技者データ!$N$11:$T$110,7,FALSE)))","v":""},null,null,null,"　　〃　         ２年",100,{"$f":"COUNTIFS($J$6:$J$125,$AL8,$O$6:$O$125,2)","v":0},null,{"$f":"COUNTIFS($Z$6:$Z$125,$AL8,$AE$6:$AE$125,2)","v":0},null,null,null,null,null,null,null,null,null,null,null,null,null,"","","","","",null,"","",null,"","","","","",null,"",""]
[null,null,4,{"$f":"IF(所属競技者データ!H14=\"\",\"\",所属競技者データ!H14&\" \"&所属競技者データ!I14)","v":""},null,null,null,null,{"$f":"IF($H9=\"\",\"\",(VLOOKUP($H9,所属競技者データ!$F$11:$L$110,2,FALSE)))","v":""},null,null,{"$f":"IF($H9=\"\",\"\",(VLOOKUP($H9,所属競技者データ!$F$11:$L$110,3,FALSE)))","v":""},{"$f":"IF($H9=\"\",\"\",(VLOOKUP($H9,所属競技者データ!$F$11:$L$110,4,FALSE)))","v":""},{"$f":"IF(H9=\"\",\"\",所属競技者データ!$I$6)","v":""},{"$f":"IF($H9=\"\",\"\",(VLOOKUP($H9,所属競技者データ!$F$11:$L$110,5,FALSE)))","v":""},{"$f":"IF($H9=\"\",\"\",(VLOOKUP($H9,所属競技者データ!$F$11:$L$110,6)))","v":""},{"$f":"IF($H9=\"\",\"\",(VLOOKUP($H9,所属競技者データ!$F$11:$L$110,7,FALSE)))","v":""},null,4,{"$f":"IF(所属競技者データ!P14=\"\",\"\",所属競技者データ!P14&\" \"&所属競技者データ!Q14)","v":""},null,null,null,null,{"$f":"IF($X9=\"\",\"\",(VLOOKUP($X9,所属競技者データ!$N$11:$T$110,2,FALSE)))","v":""},null,null,{"$f":"IF($X9=\"\",\"\",(VLOOKUP($X9,所属競技者データ!$N$11:$T$110,3,FALSE)))","v":""},{"$f":"IF($X9=\"\",\"\",(VLOOKUP($X9,所属競技者データ!$N$11:$T$110,4,FALSE)))","v":""},{"$f":"IF(X9=\"\",\"\",所属競技者データ!$I$6)","v":""},{"$f":"IF($X9=\"\",\"\",(VLOOKUP($X9,所属競技者データ!$N$11:$T$110,5,FALSE)))","v":""},{"$f":"IF($X9=\"\",\"\",(VLOOKUP($X9,所属競技者データ!$N$11:$T$110,6)))","v":""},{"$f":"IF($X9=\"\",\"\",(VLOOKUP($X9,所属競技者データ!$N$11:$T$110,7,FALSE)))","v":""},null,null,null,"　　〃　         ３年",100,{"$f":"COUNTIFS($J$6:$J$125,$AL9,$O$6:$O$125,3)","v":0},null,{"$f":"COUNTIFS($Z$6:$Z$125,$AL9,$AE$6:$AE$125,3)","v":0},null,null,null,null,null,null,null,null,null,null,null,null,null,"","","","","",null,"","",null,"","","","","",null,"",""]
[null,null,5,{"$f":"IF(所属競技者データ!H15=\"\",\"\",所属競技者データ!H15&\" \"&所属競技者データ!I15)","v":""},null,null,null,null,{"$f":"IF($H10=\"\",\"\",(VLOOKUP($H10,所属競技者データ!$F$11:$L$110,2,FALSE)))","v":""},null,null,{"$f":"IF($H10=\"\",\"\",(VLOOKUP($H10,所属競技者データ!$F$11:$L$110,3,FALSE)))","v":""},{"$f":"IF($H10=\"\",\"\",(VLOOKUP($H10,所属競技者データ!$F$11:$L$110,4,FALSE)))","v":""},{"$f":"IF(H10=\"\",\"\",所属競技者データ!$I$6)","v":""},{"$f":"IF($H10=\"\",\"\",(VLOOKUP($H10,所属競技者データ!$F$11:$L$110,5,FALSE)))","v":""},{"$f":"IF($H10=\"\",\"\",(VLOOKUP($H10,所属競技者データ!$F$11:$L$110,6)))","v":""},{"$f":"IF($H10=\"\",\"\",(VLOOKUP($H10,所属競技者データ!$F$11:$L$110,7,FALSE)))","v":""},null,5,{"$f":"IF(所属競技者データ!P15=\"\",\"\",所属競技者データ!P15&\" \"&所属競技者データ!Q15)","v":""},null,null,null,null,{"$f":"IF($X10=\"\",\"\",(VLOOKUP($X10,所属競技者データ!$N$11:$T$110,2,FALSE)))","v":""},null,null,{"$f":"IF($X10=\"\",\"\",(VLOOKUP($X10,所属競技者データ!$N$11:$T$110,3,FALSE)))","v":""},{"$f":"IF($X10=\"\",\"\",(VLOOKUP($X10,所属競技者データ!$N$11:$T$110,4,FALSE)))","v":""},{"$f":"IF(X10=\"\",\"\",所属競技者データ!$I$6)","v":""},{"$f":"IF($X10=\"\",\"\",(VLOOKUP($X10,所属競技者データ!$N$11:$T$110,5,FALSE)))","v":""},{"$f":"IF($X10=\"\",\"\",(VLOOKUP($X10,所属競技者データ!$N$11:$T$110,6)))","v":""},{"$f":"IF($X10=\"\",\"\",(VLOOKUP($X10,所属競技者データ!$N$11:$T$110,7,FALSE)))","v":""},null,null,null,"共通２００ｍ",200,{"$f":"COUNTIFS(J$6:J$125,$AL10)","v":0},"人",{"$f":"COUNTIFS(Z$6:Z$125,$AL10)","v":0},"人",null,null,null,null,null,null,null,null,null,null,null,null,"","","","","",null,"","",null,"","","","","",null,"",""]
{"$rows_left_out":147}
{"sheet":"申込み一覧男子","index":3,"n_rows":231,"n_cols":17,"rows_kept":231,"cut":false,"hidden":false,"merged":[[7,3,7,5],[8,3,8,5],[21,6,21,7],[20,6,20,7],[20,8,20,9],[21,8,21,9],[22,6,22,7],[22,8,22,9],[185,4,185,8],[185,9,185,10],[141,9,141,10],[69,4,69,8],[69,9,69,10],[127,4,127,8],[127,9,127,10],[185,11,185,16],[199,9,199,10],[199,11,199,12],[199,13,199,16],[199,2,200,2],[199,3,200,3],[199,4,200,4],[199,5,200,5],[199,6,200,6],[186,3,188,3],[186,4,188,7],[186,8,188,8],[186,9,189,9],[186,10,186,12],[187,10,189,16],[189,3,191,3],[189,4,191,7],[189,8,191,8],[190,9,191,9],[141,11,141,12],[141,13,141,16],[129,10,131,16],[131,8,133,8],[132,9,133,9],[141,2,142,2],[141,3,142,3],[141,4,142,4],[141,5,142,5],[141,6,142,6],[131,4,133,7],[127,11,127,16],[83,6,84,6],[83,9,83,10],[131,3,133,3],[128,3,130,3],[128,4,130,7],[128,8,130,8],[128,9,131,9],[128,10,128,12],[83,11,83,12],[83,13,83,16],[25,1,26,1],[83,2,84,2],[83,3,84,3],[83,4,84,4],[83,5,84,5],[73,8,75,8],[74,9,75,9],[24,15,24,16],[25,2,26,2],[25,3,26,3],[25,4,26,4],[25,5,26,5],[25,6,26,6],[24,8,24,9],[24,6,24,7],[71,10,73,16],[70,8,72,8],[70,9,73,9],[70,10,70,12],[70,3,72,3],[70,4,72,7],[73,3,75,3],[69,11,69,16],[73,4,75,7],[23,15,23,16],[11,4,11,8],[11,9,11,10],[11,11,11,16],[15,8,17,8],[16,9,17,9],[12,10,12,12],[13,10,15,16],[12,3,14,3],[12,4,14,7],[12,8,14,8],[12,9,15,9],[15,3,17,3],[15,4,17,7],[17,10,17,16],[23,8,23,9],[23,6,23,7],[5,3,5,10],[2,15,2,16],[19,1,24,1],[75,10,75,16],[133,10,133,16],[191,10,191,16],[63,3,63,10],[65,3,65,5],[66,3,66,5],[67,3,67,10],[60,15,60,16],[118,15,118,16],[121,3,121,10],[123,3,123,5],[124,3,124,5],[125,3,125,10],[176,15,176,16],[179,3,179,10],[181,3,181,5],[182,3,182,5],[183,3,183,10],[2,1,18,1],[21,15,21,16],[22,15,22,16]]}
[]
[null,null,"(様式A）"]
[null,"　右の標題内容は\n　　女子一覧表にも表示されます。",null,"第１７７ 回　松戸市陸上競技記録会中学生大会　　申込一覧表",null,null,null,null,null,null,null,null,null,null,null,1]
[]
[]
[null,null,null,"健康診断の結果異常がないことを認め、標記競技会への出場を認めます。"]
[null,null,null,null,null,null,null,null,null,null,null,"平成　２８年　６月　　日"]
[null,null,null,"松戸市陸上競技協会"]
[null,null,null,"会長　　林　英昭　様"]
[]
{"$rows_left_out":222}
{"sheet":"申込み一覧女子","index":4,"n_rows":231,"n_cols":16,"rows_kept":231,"cut":false,"hidden":false,"merged":[[19,1,24,1],[83,2,84,2],[83,3,84,3],[83,4,84,4],[83,5,84,5],[69,4,69,8],[83,6,84,6],[73,3,75,3],[73,4,75,7],[73,8,75,8],[70,4,72,7],[70,8,72,8],[25,1,26,1],[25,2,26,2],[12,4,14,7],[12,8,14,8],[12,9,15,9],[12,10,12,12],[25,6,26,6],[70,3,72,3],[65,3,65,5],[66,3,66,5],[63,3,63,10],[25,3,26,3],[25,4,26,4],[25,5,26,5],[13,10,15,16],[15,8,17,8],[16,9,17,9],[23,15,23,16],[21,15,21,16],[22,15,22,16],[83,9,83,10],[83,11,83,12],[83,13,83,16],[25,11,25,12],[25,13,25,16],[74,9,75,9],[69,11,69,16],[25,9,25,10],[69,9,69,10],[60,15,60,16],[71,10,73,16],[70,9,73,9],[70,10,70,12],[2,1,18,1],[5,3,5,10],[9,3,9,10],[2,15,2,16],[24,15,24,16],[17,10,17,16],[7,3,7,5],[8,3,8,5],[11,4,11,8],[11,9,11,10],[15,4,17,7],[11,11,11,16],[15,3,17,3],[20,6,20,7],[20,8,20,9],[21,6,21,7],[21,8,21,9],[22,6,22,7],[22,8,22,9],[23,6,23,7],[23,8,23,9],[24,6,24,7],[24,8,24,9],[12,3,14,3],[127,11,127,16],[128,3,130,3],[128,4,130,7],[128,8,130,8],[141,2,142,2],[141,3,142,3],[141,4,142,4],[141,5,142,5],[141,6,142,6],[127,4,127,8],[127,9,127,10],[199,9,199,10],[199,11,199,12],[199,13,199,16],[199,2,200,2],[199,3,200,3],[199,4,200,4],[199,5,200,5],[199,6,200,6],[186,3,188,3],[186,4,188,7],[186,8,188,8],[186,9,189,9],[186,10,186,12],[187,10,189,16],[189,3,191,3],[189,4,191,7],[189,8,191,8],[190,9,191,9],[185,4,185,8],[185,9,185,10],[118,15,118,16],[176,15,176,16],[75,10,75,16],[133,10,133,16],[191,10,191,16],[121,3,121,10],[123,3,123,5],[124,3,124,5],[179,3,179,10],[181,3,181,5],[182,3,182,5],[185,11,185,16],[131,3,133,3],[131,4,133,7],[131,8,133,8],[132,9,133,9],[128,9,131,9],[128,10,128,12],[129,10,131,16],[141,9,141,10],[141,11,141,12],[141,13,141,16]]}
[]
[null,null,"(様式A）"]
[null,"　右の標題内容は\n　　男子一覧表に入力して下さい。",null,{"$f":"IF(申込み一覧男子!D3=\"\",\"\",申込み一覧男子!D3)","v":"第１７７ 回　松戸市陸上競技記録会中学生大会　　申込一覧表"},null,null,null,null,null,null,null,null,null,null,null,1]
[]
[]
[null,null,null,"健康診断の結果異常がないことを認め、標記競技会への出場を認めます。"]
[null,null,null,null,null,null,null,null,null,null,null,{"$f":"IF(申込み一覧男子!L7=\"\",\"\",申込み一覧男子!L7)","v":"平成　２８年　６月　　日"}]
[null,null,null,{"$f":"申込み一覧男子!$D$8","v":"松戸市陸上競技協会"}]
[null,null,null,{"$f":"申込み一覧男子!$D$9","v":"会長　　林　英昭　様"}]
[]
{"$rows_left_out":221}